build from source in osx error

Previous Topic Next Topic
 
classic Classic list List threaded Threaded
2 messages Options
Reply | Threaded
Open this post in threaded view
|

build from source in osx error

karenl
Hi I am new and am trying to build from source. I am getting errors. Can someone help?
I downloaded source code from github. I tried to follow the instruction here https://github.com/LibreCAD/LibreCAD/wiki/Build-from-source 
It worked until make -j4. I also tried build-osx.sh and building from qt-creator, both didn't work.

Here is the output from make -j4:

cd libraries/ && ( test -e Makefile || /Users/karenlaw/anaconda3/bin/qmake -o Makefile /Users/karenlaw/dev/LibreCAD-master/libraries/libraries.pro -spec macx-g++ ) && /Applications/Xcode.app/Contents/Developer/usr/bin/make -f Makefile
cd libdxfrw/ && ( test -e Makefile || /Users/karenlaw/anaconda3/bin/qmake -o Makefile /Users/karenlaw/dev/LibreCAD-master/libraries/libdxfrw/libdxfrw.pro -spec macx-g++ ) && /Applications/Xcode.app/Contents/Developer/usr/bin/make -f Makefile
cd muparser/ && ( test -e Makefile || /Users/karenlaw/anaconda3/bin/qmake -o Makefile /Users/karenlaw/dev/LibreCAD-master/libraries/muparser/muparser.pro -spec macx-g++ ) && /Applications/Xcode.app/Contents/Developer/usr/bin/make -f Makefile
cd jwwlib/ && ( test -e Makefile || /Users/karenlaw/anaconda3/bin/qmake -o Makefile /Users/karenlaw/dev/LibreCAD-master/libraries/jwwlib/jwwlib.pro -spec macx-g++ ) && /Applications/Xcode.app/Contents/Developer/usr/bin/make -f Makefile
/Library/Developer/CommandLineTools/usr/bin/g++ -c -pipe -g -std=c++11 -O2 -fPIC -std=gnu++11  -arch x86_64 -isysroot /Library/Developer/CommandLineTools/SDKs/MacOSX10.14.sdk -mmacosx-version-min=10.10 -Wall -W -DQT_NO_DEBUG -I. -Iinclude -I../../../../anaconda3/mkspecs/macx-g++ -o ../../generated/lib/muparser/obj/muParserTokenReader.o src/muParserTokenReader.cpp
/Library/Developer/CommandLineTools/usr/bin/g++ -c -pipe -g -std=c++11 -O2 -fPIC -std=gnu++11  -arch x86_64 -isysroot /Library/Developer/CommandLineTools/SDKs/MacOSX10.14.sdk -mmacosx-version-min=10.10 -Wall -W -DQT_NO_DEBUG -I. -I../../../../anaconda3/mkspecs/macx-g++ -o ../../generated/lib/libdxfrw/obj/libdxfrw.o src/libdxfrw.cpp
/Library/Developer/CommandLineTools/usr/bin/g++ -c -pipe -g -O2 -fPIC -std=gnu++11  -arch x86_64 -isysroot /Library/Developer/CommandLineTools/SDKs/MacOSX10.14.sdk -mmacosx-version-min=10.10 -Wall -W -DQT_NO_DEBUG -DQT_SVG_LIB -DQT_WIDGETS_LIB -DQT_GUI_LIB -DQT_CORE_LIB -I. -I../../../../anaconda3/include/qt -I../../../../anaconda3/include/qt/QtSvg -I../../../../anaconda3/include/qt/QtWidgets -I../../../../anaconda3/include/qt/QtGui -I../../../../anaconda3/include/qt/QtCore -I../../generated/lib/jwwlib/moc -I/Library/Developer/CommandLineTools/SDKs/MacOSX10.14.sdk/System/Library/Frameworks/OpenGL.framework/Headers -I/Library/Developer/CommandLineTools/SDKs/MacOSX10.14.sdk/System/Library/Frameworks/AGL.framework/Headers -I../../../../anaconda3/mkspecs/macx-g++ -o ../../generated/lib/jwwlib/obj/dl_writer_ascii.o src/dl_writer_ascii.cpp
/Library/Developer/CommandLineTools/usr/bin/g++ -c -pipe -g -std=c++11 -O2 -fPIC -std=gnu++11  -arch x86_64 -isysroot /Library/Developer/CommandLineTools/SDKs/MacOSX10.14.sdk -mmacosx-version-min=10.10 -Wall -W -DQT_NO_DEBUG -I. -Iinclude -I../../../../anaconda3/mkspecs/macx-g++ -o ../../generated/lib/muparser/obj/muParserError.o src/muParserError.cpp
/Library/Developer/CommandLineTools/usr/bin/g++ -c -pipe -g -O2 -fPIC -std=gnu++11  -arch x86_64 -isysroot /Library/Developer/CommandLineTools/SDKs/MacOSX10.14.sdk -mmacosx-version-min=10.10 -Wall -W -DQT_NO_DEBUG -DQT_SVG_LIB -DQT_WIDGETS_LIB -DQT_GUI_LIB -DQT_CORE_LIB -I. -I../../../../anaconda3/include/qt -I../../../../anaconda3/include/qt/QtSvg -I../../../../anaconda3/include/qt/QtWidgets -I../../../../anaconda3/include/qt/QtGui -I../../../../anaconda3/include/qt/QtCore -I../../generated/lib/jwwlib/moc -I/Library/Developer/CommandLineTools/SDKs/MacOSX10.14.sdk/System/Library/Frameworks/OpenGL.framework/Headers -I/Library/Developer/CommandLineTools/SDKs/MacOSX10.14.sdk/System/Library/Frameworks/AGL.framework/Headers -I../../../../anaconda3/mkspecs/macx-g++ -o ../../generated/lib/jwwlib/obj/dl_jww.o src/dl_jww.cpp
/Library/Developer/CommandLineTools/usr/bin/g++ -c -pipe -g -std=c++11 -O2 -fPIC -std=gnu++11  -arch x86_64 -isysroot /Library/Developer/CommandLineTools/SDKs/MacOSX10.14.sdk -mmacosx-version-min=10.10 -Wall -W -DQT_NO_DEBUG -I. -I../../../../anaconda3/mkspecs/macx-g++ -o ../../generated/lib/libdxfrw/obj/libdwgr.o src/libdwgr.cpp
/Library/Developer/CommandLineTools/usr/bin/g++ -c -pipe -g -std=c++11 -O2 -fPIC -std=gnu++11  -arch x86_64 -isysroot /Library/Developer/CommandLineTools/SDKs/MacOSX10.14.sdk -mmacosx-version-min=10.10 -Wall -W -DQT_NO_DEBUG -I. -Iinclude -I../../../../anaconda3/mkspecs/macx-g++ -o ../../generated/lib/muparser/obj/muParserCallback.o src/muParserCallback.cpp
/Library/Developer/CommandLineTools/usr/bin/g++ -c -pipe -g -std=c++11 -O2 -fPIC -std=gnu++11  -arch x86_64 -isysroot /Library/Developer/CommandLineTools/SDKs/MacOSX10.14.sdk -mmacosx-version-min=10.10 -Wall -W -DQT_NO_DEBUG -I. -Iinclude -I../../../../anaconda3/mkspecs/macx-g++ -o ../../generated/lib/muparser/obj/muParserBytecode.o src/muParserBytecode.cpp
/Library/Developer/CommandLineTools/usr/bin/g++ -c -pipe -g -O2 -fPIC -std=gnu++11  -arch x86_64 -isysroot /Library/Developer/CommandLineTools/SDKs/MacOSX10.14.sdk -mmacosx-version-min=10.10 -Wall -W -DQT_NO_DEBUG -DQT_SVG_LIB -DQT_WIDGETS_LIB -DQT_GUI_LIB -DQT_CORE_LIB -I. -I../../../../anaconda3/include/qt -I../../../../anaconda3/include/qt/QtSvg -I../../../../anaconda3/include/qt/QtWidgets -I../../../../anaconda3/include/qt/QtGui -I../../../../anaconda3/include/qt/QtCore -I../../generated/lib/jwwlib/moc -I/Library/Developer/CommandLineTools/SDKs/MacOSX10.14.sdk/System/Library/Frameworks/OpenGL.framework/Headers -I/Library/Developer/CommandLineTools/SDKs/MacOSX10.14.sdk/System/Library/Frameworks/AGL.framework/Headers -I../../../../anaconda3/mkspecs/macx-g++ -o ../../generated/lib/jwwlib/obj/jwwdoc.o src/jwwdoc.cpp
/Library/Developer/CommandLineTools/usr/bin/g++ -c -pipe -g -std=c++11 -O2 -fPIC -std=gnu++11  -arch x86_64 -isysroot /Library/Developer/CommandLineTools/SDKs/MacOSX10.14.sdk -mmacosx-version-min=10.10 -Wall -W -DQT_NO_DEBUG -I. -Iinclude -I../../../../anaconda3/mkspecs/macx-g++ -o ../../generated/lib/muparser/obj/muParserBase.o src/muParserBase.cpp
/Library/Developer/CommandLineTools/usr/bin/g++ -c -pipe -g -std=c++11 -O2 -fPIC -std=gnu++11  -arch x86_64 -isysroot /Library/Developer/CommandLineTools/SDKs/MacOSX10.14.sdk -mmacosx-version-min=10.10 -Wall -W -DQT_NO_DEBUG -I. -I../../../../anaconda3/mkspecs/macx-g++ -o ../../generated/lib/libdxfrw/obj/drw_header.o src/drw_header.cpp
rm -f ../../generated/lib/libjwwlib.a
/Library/Developer/CommandLineTools/usr/bin/ar cq ../../generated/lib/libjwwlib.a ../../generated/lib/jwwlib/obj/dl_writer_ascii.o ../../generated/lib/jwwlib/obj/dl_jww.o ../../generated/lib/jwwlib/obj/jwwdoc.o
/Library/Developer/CommandLineTools/usr/bin/ranlib -s ../../generated/lib/libjwwlib.a
/Library/Developer/CommandLineTools/usr/bin/g++ -c -pipe -g -std=c++11 -O2 -fPIC -std=gnu++11  -arch x86_64 -isysroot /Library/Developer/CommandLineTools/SDKs/MacOSX10.14.sdk -mmacosx-version-min=10.10 -Wall -W -DQT_NO_DEBUG -I. -Iinclude -I../../../../anaconda3/mkspecs/macx-g++ -o ../../generated/lib/muparser/obj/muParser.o src/muParser.cpp
/Library/Developer/CommandLineTools/usr/bin/g++ -c -pipe -g -std=c++11 -O2 -fPIC -std=gnu++11  -arch x86_64 -isysroot /Library/Developer/CommandLineTools/SDKs/MacOSX10.14.sdk -mmacosx-version-min=10.10 -Wall -W -DQT_NO_DEBUG -I. -I../../../../anaconda3/mkspecs/macx-g++ -o ../../generated/lib/libdxfrw/obj/drw_classes.o src/drw_classes.cpp
/Library/Developer/CommandLineTools/usr/bin/g++ -c -pipe -g -std=c++11 -O2 -fPIC -std=gnu++11  -arch x86_64 -isysroot /Library/Developer/CommandLineTools/SDKs/MacOSX10.14.sdk -mmacosx-version-min=10.10 -Wall -W -DQT_NO_DEBUG -I. -I../../../../anaconda3/mkspecs/macx-g++ -o ../../generated/lib/libdxfrw/obj/drw_entities.o src/drw_entities.cpp
rm -f ../../generated/lib/libmuparser.a
/Library/Developer/CommandLineTools/usr/bin/ar cq ../../generated/lib/libmuparser.a ../../generated/lib/muparser/obj/muParserTokenReader.o ../../generated/lib/muparser/obj/muParserError.o ../../generated/lib/muparser/obj/muParserCallback.o ../../generated/lib/muparser/obj/muParserBytecode.o ../../generated/lib/muparser/obj/muParserBase.o ../../generated/lib/muparser/obj/muParser.o
/Library/Developer/CommandLineTools/usr/bin/ranlib -s ../../generated/lib/libmuparser.a
/Library/Developer/CommandLineTools/usr/bin/g++ -c -pipe -g -std=c++11 -O2 -fPIC -std=gnu++11  -arch x86_64 -isysroot /Library/Developer/CommandLineTools/SDKs/MacOSX10.14.sdk -mmacosx-version-min=10.10 -Wall -W -DQT_NO_DEBUG -I. -I../../../../anaconda3/mkspecs/macx-g++ -o ../../generated/lib/libdxfrw/obj/drw_objects.o src/drw_objects.cpp
/Library/Developer/CommandLineTools/usr/bin/g++ -c -pipe -g -std=c++11 -O2 -fPIC -std=gnu++11  -arch x86_64 -isysroot /Library/Developer/CommandLineTools/SDKs/MacOSX10.14.sdk -mmacosx-version-min=10.10 -Wall -W -DQT_NO_DEBUG -I. -I../../../../anaconda3/mkspecs/macx-g++ -o ../../generated/lib/libdxfrw/obj/drw_textcodec.o src/intern/drw_textcodec.cpp
src/drw_objects.cpp:1221:79: warning: unused parameter 'bs' [-Wunused-parameter]
bool DRW_PlotSettings::parseDwg(DRW::Version version, dwgBuffer *buf, duint32 bs){
                                                                              ^
/Library/Developer/CommandLineTools/usr/bin/g++ -c -pipe -g -std=c++11 -O2 -fPIC -std=gnu++11  -arch x86_64 -isysroot /Library/Developer/CommandLineTools/SDKs/MacOSX10.14.sdk -mmacosx-version-min=10.10 -Wall -W -DQT_NO_DEBUG -I. -I../../../../anaconda3/mkspecs/macx-g++ -o ../../generated/lib/libdxfrw/obj/dxfreader.o src/intern/dxfreader.cpp
/Library/Developer/CommandLineTools/usr/bin/g++ -c -pipe -g -std=c++11 -O2 -fPIC -std=gnu++11  -arch x86_64 -isysroot /Library/Developer/CommandLineTools/SDKs/MacOSX10.14.sdk -mmacosx-version-min=10.10 -Wall -W -DQT_NO_DEBUG -I. -I../../../../anaconda3/mkspecs/macx-g++ -o ../../generated/lib/libdxfrw/obj/dxfwriter.o src/intern/dxfwriter.cpp
1 warning generated.
/Library/Developer/CommandLineTools/usr/bin/g++ -c -pipe -g -std=c++11 -O2 -fPIC -std=gnu++11  -arch x86_64 -isysroot /Library/Developer/CommandLineTools/SDKs/MacOSX10.14.sdk -mmacosx-version-min=10.10 -Wall -W -DQT_NO_DEBUG -I. -I../../../../anaconda3/mkspecs/macx-g++ -o ../../generated/lib/libdxfrw/obj/dwgreader.o src/intern/dwgreader.cpp
/Library/Developer/CommandLineTools/usr/bin/g++ -c -pipe -g -std=c++11 -O2 -fPIC -std=gnu++11  -arch x86_64 -isysroot /Library/Developer/CommandLineTools/SDKs/MacOSX10.14.sdk -mmacosx-version-min=10.10 -Wall -W -DQT_NO_DEBUG -I. -I../../../../anaconda3/mkspecs/macx-g++ -o ../../generated/lib/libdxfrw/obj/dwgbuffer.o src/intern/dwgbuffer.cpp
/Library/Developer/CommandLineTools/usr/bin/g++ -c -pipe -g -std=c++11 -O2 -fPIC -std=gnu++11  -arch x86_64 -isysroot /Library/Developer/CommandLineTools/SDKs/MacOSX10.14.sdk -mmacosx-version-min=10.10 -Wall -W -DQT_NO_DEBUG -I. -I../../../../anaconda3/mkspecs/macx-g++ -o ../../generated/lib/libdxfrw/obj/drw_dbg.o src/intern/drw_dbg.cpp
/Library/Developer/CommandLineTools/usr/bin/g++ -c -pipe -g -std=c++11 -O2 -fPIC -std=gnu++11  -arch x86_64 -isysroot /Library/Developer/CommandLineTools/SDKs/MacOSX10.14.sdk -mmacosx-version-min=10.10 -Wall -W -DQT_NO_DEBUG -I. -I../../../../anaconda3/mkspecs/macx-g++ -o ../../generated/lib/libdxfrw/obj/dwgreader21.o src/intern/dwgreader21.cpp
/Library/Developer/CommandLineTools/usr/bin/g++ -c -pipe -g -std=c++11 -O2 -fPIC -std=gnu++11  -arch x86_64 -isysroot /Library/Developer/CommandLineTools/SDKs/MacOSX10.14.sdk -mmacosx-version-min=10.10 -Wall -W -DQT_NO_DEBUG -I. -I../../../../anaconda3/mkspecs/macx-g++ -o ../../generated/lib/libdxfrw/obj/dwgreader18.o src/intern/dwgreader18.cpp
/Library/Developer/CommandLineTools/usr/bin/g++ -c -pipe -g -std=c++11 -O2 -fPIC -std=gnu++11  -arch x86_64 -isysroot /Library/Developer/CommandLineTools/SDKs/MacOSX10.14.sdk -mmacosx-version-min=10.10 -Wall -W -DQT_NO_DEBUG -I. -I../../../../anaconda3/mkspecs/macx-g++ -o ../../generated/lib/libdxfrw/obj/dwgreader15.o src/intern/dwgreader15.cpp
/Library/Developer/CommandLineTools/usr/bin/g++ -c -pipe -g -std=c++11 -O2 -fPIC -std=gnu++11  -arch x86_64 -isysroot /Library/Developer/CommandLineTools/SDKs/MacOSX10.14.sdk -mmacosx-version-min=10.10 -Wall -W -DQT_NO_DEBUG -I. -I../../../../anaconda3/mkspecs/macx-g++ -o ../../generated/lib/libdxfrw/obj/dwgutil.o src/intern/dwgutil.cpp
/Library/Developer/CommandLineTools/usr/bin/g++ -c -pipe -g -std=c++11 -O2 -fPIC -std=gnu++11  -arch x86_64 -isysroot /Library/Developer/CommandLineTools/SDKs/MacOSX10.14.sdk -mmacosx-version-min=10.10 -Wall -W -DQT_NO_DEBUG -I. -I../../../../anaconda3/mkspecs/macx-g++ -o ../../generated/lib/libdxfrw/obj/rscodec.o src/intern/rscodec.cpp
/Library/Developer/CommandLineTools/usr/bin/g++ -c -pipe -g -std=c++11 -O2 -fPIC -std=gnu++11  -arch x86_64 -isysroot /Library/Developer/CommandLineTools/SDKs/MacOSX10.14.sdk -mmacosx-version-min=10.10 -Wall -W -DQT_NO_DEBUG -I. -I../../../../anaconda3/mkspecs/macx-g++ -o ../../generated/lib/libdxfrw/obj/dwgreader27.o src/intern/dwgreader27.cpp
/Library/Developer/CommandLineTools/usr/bin/g++ -c -pipe -g -std=c++11 -O2 -fPIC -std=gnu++11  -arch x86_64 -isysroot /Library/Developer/CommandLineTools/SDKs/MacOSX10.14.sdk -mmacosx-version-min=10.10 -Wall -W -DQT_NO_DEBUG -I. -I../../../../anaconda3/mkspecs/macx-g++ -o ../../generated/lib/libdxfrw/obj/dwgreader24.o src/intern/dwgreader24.cpp
rm -f ../../generated/lib/libdxfrw.a
/Library/Developer/CommandLineTools/usr/bin/ar cq ../../generated/lib/libdxfrw.a ../../generated/lib/libdxfrw/obj/libdxfrw.o ../../generated/lib/libdxfrw/obj/libdwgr.o ../../generated/lib/libdxfrw/obj/drw_header.o ../../generated/lib/libdxfrw/obj/drw_classes.o ../../generated/lib/libdxfrw/obj/drw_entities.o ../../generated/lib/libdxfrw/obj/drw_objects.o ../../generated/lib/libdxfrw/obj/drw_textcodec.o ../../generated/lib/libdxfrw/obj/dxfreader.o ../../generated/lib/libdxfrw/obj/dxfwriter.o ../../generated/lib/libdxfrw/obj/dwgreader.o ../../generated/lib/libdxfrw/obj/dwgbuffer.o ../../generated/lib/libdxfrw/obj/drw_dbg.o ../../generated/lib/libdxfrw/obj/dwgreader21.o ../../generated/lib/libdxfrw/obj/dwgreader18.o ../../generated/lib/libdxfrw/obj/dwgreader15.o ../../generated/lib/libdxfrw/obj/dwgutil.o ../../generated/lib/libdxfrw/obj/rscodec.o ../../generated/lib/libdxfrw/obj/dwgreader27.o ../../generated/lib/libdxfrw/obj/dwgreader24.o
/Library/Developer/CommandLineTools/usr/bin/ranlib -s ../../generated/lib/libdxfrw.a
cd librecad/ && ( test -e Makefile || /Users/karenlaw/anaconda3/bin/qmake -o Makefile /Users/karenlaw/dev/LibreCAD-master/librecad/librecad.pro -spec macx-g++ ) && /Applications/Xcode.app/Contents/Developer/usr/bin/make -f Makefile
cd src/ && ( test -e Makefile || /Users/karenlaw/anaconda3/bin/qmake -o Makefile /Users/karenlaw/dev/LibreCAD-master/librecad/src/src.pro -spec macx-g++ ) && /Applications/Xcode.app/Contents/Developer/usr/bin/make -f Makefile
/Users/karenlaw/anaconda3/bin/uic ui/forms/qg_commandwidget.ui -o ../../generated/librecad/ui/ui_qg_commandwidget.h
/Users/karenlaw/anaconda3/bin/uic ui/forms/qg_arcoptions.ui -o ../../generated/librecad/ui/ui_qg_arcoptions.h
/Users/karenlaw/anaconda3/bin/uic ui/forms/qg_arctangentialoptions.ui -o ../../generated/librecad/ui/ui_qg_arctangentialoptions.h
/Users/karenlaw/anaconda3/bin/uic ui/forms/qg_beveloptions.ui -o ../../generated/librecad/ui/ui_qg_beveloptions.h
/Users/karenlaw/anaconda3/bin/uic ui/forms/qg_blockdialog.ui -o ../../generated/librecad/ui/ui_qg_blockdialog.h
/Users/karenlaw/anaconda3/bin/uic ui/forms/qg_circleoptions.ui -o ../../generated/librecad/ui/ui_qg_circleoptions.h
/Users/karenlaw/anaconda3/bin/uic ui/forms/qg_circletan2options.ui -o ../../generated/librecad/ui/ui_qg_circletan2options.h
/Users/karenlaw/anaconda3/bin/uic ui/forms/qg_coordinatewidget.ui -o ../../generated/librecad/ui/ui_qg_coordinatewidget.h
/Users/karenlaw/anaconda3/bin/uic ui/forms/qg_dimensionlabeleditor.ui -o ../../generated/librecad/ui/ui_qg_dimensionlabeleditor.h
/Users/karenlaw/anaconda3/bin/uic ui/forms/qg_dimlinearoptions.ui -o ../../generated/librecad/ui/ui_qg_dimlinearoptions.h
/Users/karenlaw/anaconda3/bin/uic ui/forms/qg_dimoptions.ui -o ../../generated/librecad/ui/ui_qg_dimoptions.h
/Users/karenlaw/anaconda3/bin/uic ui/forms/qg_widgetpen.ui -o ../../generated/librecad/ui/ui_qg_widgetpen.h
/Users/karenlaw/anaconda3/bin/uic ui/forms/qg_dlghatch.ui -o ../../generated/librecad/ui/ui_qg_dlghatch.h
/Users/karenlaw/anaconda3/bin/uic ui/forms/qg_dlginitial.ui -o ../../generated/librecad/ui/ui_qg_dlginitial.h
/Users/karenlaw/anaconda3/bin/uic ui/forms/qg_dlgimageoptions.ui -o ../../generated/librecad/ui/ui_qg_dlgimageoptions.h
/Users/karenlaw/anaconda3/bin/uic ui/forms/qg_dlgmirror.ui -o ../../generated/librecad/ui/ui_qg_dlgmirror.h
/Users/karenlaw/anaconda3/bin/uic ui/forms/qg_dlgmove.ui -o ../../generated/librecad/ui/ui_qg_dlgmove.h
/Users/karenlaw/anaconda3/bin/uic ui/forms/qg_dlgmoverotate.ui -o ../../generated/librecad/ui/ui_qg_dlgmoverotate.h
/Users/karenlaw/anaconda3/bin/uic ui/forms/qg_dlgmtext.ui -o ../../generated/librecad/ui/ui_qg_dlgmtext.h
/Users/karenlaw/anaconda3/bin/uic ui/forms/qg_dlgoptionsdrawing.ui -o ../../generated/librecad/ui/ui_qg_dlgoptionsdrawing.h
/Users/karenlaw/anaconda3/bin/uic ui/forms/qg_dlgoptionsgeneral.ui -o ../../generated/librecad/ui/ui_qg_dlgoptionsgeneral.h
/Users/karenlaw/anaconda3/bin/uic ui/forms/qg_dlgoptionsmakercam.ui -o ../../generated/librecad/ui/ui_qg_dlgoptionsmakercam.h
/Users/karenlaw/anaconda3/bin/uic ui/forms/qg_dlgpoint.ui -o ../../generated/librecad/ui/ui_qg_dlgpoint.h
/Users/karenlaw/anaconda3/bin/uic ui/forms/qg_dlgpolyline.ui -o ../../generated/librecad/ui/ui_qg_dlgpolyline.h
/Users/karenlaw/anaconda3/bin/uic ui/forms/qg_dlgrotate.ui -o ../../generated/librecad/ui/ui_qg_dlgrotate.h
/Users/karenlaw/anaconda3/bin/uic ui/forms/qg_dlgrotate2.ui -o ../../generated/librecad/ui/ui_qg_dlgrotate2.h
/Users/karenlaw/anaconda3/bin/uic ui/forms/qg_dlgscale.ui -o ../../generated/librecad/ui/ui_qg_dlgscale.h
/Users/karenlaw/anaconda3/bin/uic ui/forms/qg_dlgspline.ui -o ../../generated/librecad/ui/ui_qg_dlgspline.h
/Users/karenlaw/anaconda3/bin/uic ui/forms/qg_dlgtext.ui -o ../../generated/librecad/ui/ui_qg_dlgtext.h
/Users/karenlaw/anaconda3/bin/uic ui/forms/qg_exitdialog.ui -o ../../generated/librecad/ui/ui_qg_exitdialog.h
/Users/karenlaw/anaconda3/bin/uic ui/forms/qg_imageoptions.ui -o ../../generated/librecad/ui/ui_qg_imageoptions.h
/Users/karenlaw/anaconda3/bin/uic ui/forms/qg_insertoptions.ui -o ../../generated/librecad/ui/ui_qg_insertoptions.h
/Users/karenlaw/anaconda3/bin/uic ui/forms/qg_layerdialog.ui -o ../../generated/librecad/ui/ui_qg_layerdialog.h
/Users/karenlaw/anaconda3/bin/uic ui/forms/qg_libraryinsertoptions.ui -o ../../generated/librecad/ui/ui_qg_libraryinsertoptions.h
/Users/karenlaw/anaconda3/bin/uic ui/forms/qg_lineangleoptions.ui -o ../../generated/librecad/ui/ui_qg_lineangleoptions.h
/Users/karenlaw/anaconda3/bin/uic ui/forms/qg_linebisectoroptions.ui -o ../../generated/librecad/ui/ui_qg_linebisectoroptions.h
/Users/karenlaw/anaconda3/bin/uic ui/forms/qg_lineoptions.ui -o ../../generated/librecad/ui/ui_qg_lineoptions.h
/Users/karenlaw/anaconda3/bin/uic ui/forms/qg_lineparalleloptions.ui -o ../../generated/librecad/ui/ui_qg_lineparalleloptions.h
/Users/karenlaw/anaconda3/bin/uic ui/forms/qg_lineparallelthroughoptions.ui -o ../../generated/librecad/ui/ui_qg_lineparallelthroughoptions.h
/Users/karenlaw/anaconda3/bin/uic ui/forms/qg_linepolygon2options.ui -o ../../generated/librecad/ui/ui_qg_linepolygon2options.h
/Users/karenlaw/anaconda3/bin/uic ui/forms/qg_linepolygonoptions.ui -o ../../generated/librecad/ui/ui_qg_linepolygonoptions.h
/Users/karenlaw/anaconda3/bin/uic ui/forms/qg_linerelangleoptions.ui -o ../../generated/librecad/ui/ui_qg_linerelangleoptions.h
/Users/karenlaw/anaconda3/bin/uic ui/forms/qg_modifyoffsetoptions.ui -o ../../generated/librecad/ui/ui_qg_modifyoffsetoptions.h
/Users/karenlaw/anaconda3/bin/uic ui/forms/qg_mousewidget.ui -o ../../generated/librecad/ui/ui_qg_mousewidget.h
/Users/karenlaw/anaconda3/bin/uic ui/forms/qg_moverotateoptions.ui -o ../../generated/librecad/ui/ui_qg_moverotateoptions.h
/Users/karenlaw/anaconda3/bin/uic ui/forms/qg_mtextoptions.ui -o ../../generated/librecad/ui/ui_qg_mtextoptions.h
/Users/karenlaw/anaconda3/bin/uic ui/forms/qg_polylineoptions.ui -o ../../generated/librecad/ui/ui_qg_polylineoptions.h
/Users/karenlaw/anaconda3/bin/uic ui/forms/qg_polylineequidistantoptions.ui -o ../../generated/librecad/ui/ui_qg_polylineequidistantoptions.h
/Users/karenlaw/anaconda3/bin/uic ui/forms/qg_printpreviewoptions.ui -o ../../generated/librecad/ui/ui_qg_printpreviewoptions.h
/Users/karenlaw/anaconda3/bin/uic ui/forms/qg_roundoptions.ui -o ../../generated/librecad/ui/ui_qg_roundoptions.h
/Users/karenlaw/anaconda3/bin/uic ui/forms/qg_selectionwidget.ui -o ../../generated/librecad/ui/ui_qg_selectionwidget.h
/Users/karenlaw/anaconda3/bin/uic ui/forms/qg_snapdistoptions.ui -o ../../generated/librecad/ui/ui_qg_snapdistoptions.h
/Users/karenlaw/anaconda3/bin/uic ui/forms/qg_snapmiddleoptions.ui -o ../../generated/librecad/ui/ui_qg_snapmiddleoptions.h
/Users/karenlaw/anaconda3/bin/uic ui/forms/qg_splineoptions.ui -o ../../generated/librecad/ui/ui_qg_splineoptions.h
/Users/karenlaw/anaconda3/bin/uic ui/forms/qg_textoptions.ui -o ../../generated/librecad/ui/ui_qg_textoptions.h
/Users/karenlaw/anaconda3/bin/uic ui/forms/qg_trimamountoptions.ui -o ../../generated/librecad/ui/ui_qg_trimamountoptions.h
/Users/karenlaw/anaconda3/bin/uic ui/forms/qg_snaptoolbar.ui -o ../../generated/librecad/ui/ui_qg_snaptoolbar.h
/Users/karenlaw/anaconda3/bin/uic ui/forms/qg_activelayername.ui -o ../../generated/librecad/ui/ui_qg_activelayername.h
/Users/karenlaw/anaconda3/bin/uic ui/forms/lc_dlgsplinepoints.ui -o ../../generated/librecad/ui/ui_lc_dlgsplinepoints.h
/Users/karenlaw/anaconda3/bin/uic ui/forms/lc_widgetoptionsdialog.ui -o ../../generated/librecad/ui/ui_lc_widgetoptionsdialog.h
/Users/karenlaw/anaconda3/bin/uic ui/lc_deviceoptions.ui -o ../../generated/librecad/ui/ui_lc_deviceoptions.h
/Users/karenlaw/anaconda3/bin/uic ui/generic/comboboxoption.ui -o ../../generated/librecad/ui/ui_comboboxoption.h
/Users/karenlaw/anaconda3/bin/uic ui/generic/widgetcreator.ui -o ../../generated/librecad/ui/ui_widgetcreator.h
/Users/karenlaw/anaconda3/bin/uic ui/generic/colorwizard.ui -o ../../generated/librecad/ui/ui_colorwizard.h
/Users/karenlaw/anaconda3/bin/uic ui/generic/textfileviewer.ui -o ../../generated/librecad/ui/ui_textfileviewer.h
/Library/Developer/CommandLineTools/usr/bin/g++ -c -pipe -g -O2 -std=gnu++11  -arch x86_64 -isysroot /Library/Developer/CommandLineTools/SDKs/MacOSX10.14.sdk -mmacosx-version-min=10.10 -Wall -W -fPIC -DDWGSUPPORT -DQC_APPDIR="LibreCAD" -DLC_VERSION="2.2.0-alpha" -DQT_NO_DEBUG -DQT_SVG_LIB -DQT_PRINTSUPPORT_LIB -DQT_WIDGETS_LIB -DQT_GUI_LIB -DQT_CORE_LIB -I. -I/usr/local/include -I../../libraries/muparser/include -I../../libraries/libdxfrw/src -I../../libraries/jwwlib/src -Icmd -Ilib/actions -Ilib/creation -Ilib/debug -Ilib/engine -Ilib/fileio -Ilib/filters -Ilib/generators -Ilib/gui -Ilib/information -Ilib/math -Ilib/modification -Ilib/printing -Iactions -Imain -Imain/console_dxf2pdf -Itest -Iplugins -Iui -Iui/forms -Iui/generic -I../res -I../../../../anaconda3/include/qt -I../../../../anaconda3/include/qt/QtSvg -I../../../../anaconda3/include/qt/QtPrintSupport -I../../../../anaconda3/include/qt/QtWidgets -I../../../../anaconda3/include/qt/QtGui -I../../../../anaconda3/include/qt/QtCore -I../../generated/librecad/moc -I/Library/Developer/CommandLineTools/SDKs/MacOSX10.14.sdk/System/Library/Frameworks/OpenGL.framework/Headers -I/Library/Developer/CommandLineTools/SDKs/MacOSX10.14.sdk/System/Library/Frameworks/AGL.framework/Headers -I../../generated/librecad/ui -I../../../../anaconda3/mkspecs/macx-g++ -o ../../generated/librecad/obj/rs_actioninterface.o lib/actions/rs_actioninterface.cpp
/Library/Developer/CommandLineTools/usr/bin/g++ -c -pipe -g -O2 -std=gnu++11  -arch x86_64 -isysroot /Library/Developer/CommandLineTools/SDKs/MacOSX10.14.sdk -mmacosx-version-min=10.10 -Wall -W -fPIC -DDWGSUPPORT -DQC_APPDIR="LibreCAD" -DLC_VERSION="2.2.0-alpha" -DQT_NO_DEBUG -DQT_SVG_LIB -DQT_PRINTSUPPORT_LIB -DQT_WIDGETS_LIB -DQT_GUI_LIB -DQT_CORE_LIB -I. -I/usr/local/include -I../../libraries/muparser/include -I../../libraries/libdxfrw/src -I../../libraries/jwwlib/src -Icmd -Ilib/actions -Ilib/creation -Ilib/debug -Ilib/engine -Ilib/fileio -Ilib/filters -Ilib/generators -Ilib/gui -Ilib/information -Ilib/math -Ilib/modification -Ilib/printing -Iactions -Imain -Imain/console_dxf2pdf -Itest -Iplugins -Iui -Iui/forms -Iui/generic -I../res -I../../../../anaconda3/include/qt -I../../../../anaconda3/include/qt/QtSvg -I../../../../anaconda3/include/qt/QtPrintSupport -I../../../../anaconda3/include/qt/QtWidgets -I../../../../anaconda3/include/qt/QtGui -I../../../../anaconda3/include/qt/QtCore -I../../generated/librecad/moc -I/Library/Developer/CommandLineTools/SDKs/MacOSX10.14.sdk/System/Library/Frameworks/OpenGL.framework/Headers -I/Library/Developer/CommandLineTools/SDKs/MacOSX10.14.sdk/System/Library/Frameworks/AGL.framework/Headers -I../../generated/librecad/ui -I../../../../anaconda3/mkspecs/macx-g++ -o ../../generated/librecad/obj/rs_preview.o lib/actions/rs_preview.cpp
/Library/Developer/CommandLineTools/usr/bin/g++ -c -pipe -g -O2 -std=gnu++11  -arch x86_64 -isysroot /Library/Developer/CommandLineTools/SDKs/MacOSX10.14.sdk -mmacosx-version-min=10.10 -Wall -W -fPIC -DDWGSUPPORT -DQC_APPDIR="LibreCAD" -DLC_VERSION="2.2.0-alpha" -DQT_NO_DEBUG -DQT_SVG_LIB -DQT_PRINTSUPPORT_LIB -DQT_WIDGETS_LIB -DQT_GUI_LIB -DQT_CORE_LIB -I. -I/usr/local/include -I../../libraries/muparser/include -I../../libraries/libdxfrw/src -I../../libraries/jwwlib/src -Icmd -Ilib/actions -Ilib/creation -Ilib/debug -Ilib/engine -Ilib/fileio -Ilib/filters -Ilib/generators -Ilib/gui -Ilib/information -Ilib/math -Ilib/modification -Ilib/printing -Iactions -Imain -Imain/console_dxf2pdf -Itest -Iplugins -Iui -Iui/forms -Iui/generic -I../res -I../../../../anaconda3/include/qt -I../../../../anaconda3/include/qt/QtSvg -I../../../../anaconda3/include/qt/QtPrintSupport -I../../../../anaconda3/include/qt/QtWidgets -I../../../../anaconda3/include/qt/QtGui -I../../../../anaconda3/include/qt/QtCore -I../../generated/librecad/moc -I/Library/Developer/CommandLineTools/SDKs/MacOSX10.14.sdk/System/Library/Frameworks/OpenGL.framework/Headers -I/Library/Developer/CommandLineTools/SDKs/MacOSX10.14.sdk/System/Library/Frameworks/AGL.framework/Headers -I../../generated/librecad/ui -I../../../../anaconda3/mkspecs/macx-g++ -o ../../generated/librecad/obj/rs_previewactioninterface.o lib/actions/rs_previewactioninterface.cpp
/Library/Developer/CommandLineTools/usr/bin/g++ -c -pipe -g -O2 -std=gnu++11  -arch x86_64 -isysroot /Library/Developer/CommandLineTools/SDKs/MacOSX10.14.sdk -mmacosx-version-min=10.10 -Wall -W -fPIC -DDWGSUPPORT -DQC_APPDIR="LibreCAD" -DLC_VERSION="2.2.0-alpha" -DQT_NO_DEBUG -DQT_SVG_LIB -DQT_PRINTSUPPORT_LIB -DQT_WIDGETS_LIB -DQT_GUI_LIB -DQT_CORE_LIB -I. -I/usr/local/include -I../../libraries/muparser/include -I../../libraries/libdxfrw/src -I../../libraries/jwwlib/src -Icmd -Ilib/actions -Ilib/creation -Ilib/debug -Ilib/engine -Ilib/fileio -Ilib/filters -Ilib/generators -Ilib/gui -Ilib/information -Ilib/math -Ilib/modification -Ilib/printing -Iactions -Imain -Imain/console_dxf2pdf -Itest -Iplugins -Iui -Iui/forms -Iui/generic -I../res -I../../../../anaconda3/include/qt -I../../../../anaconda3/include/qt/QtSvg -I../../../../anaconda3/include/qt/QtPrintSupport -I../../../../anaconda3/include/qt/QtWidgets -I../../../../anaconda3/include/qt/QtGui -I../../../../anaconda3/include/qt/QtCore -I../../generated/librecad/moc -I/Library/Developer/CommandLineTools/SDKs/MacOSX10.14.sdk/System/Library/Frameworks/OpenGL.framework/Headers -I/Library/Developer/CommandLineTools/SDKs/MacOSX10.14.sdk/System/Library/Frameworks/AGL.framework/Headers -I../../generated/librecad/ui -I../../../../anaconda3/mkspecs/macx-g++ -o ../../generated/librecad/obj/rs_snapper.o lib/actions/rs_snapper.cpp
In file included from lib/actions/rs_snapper.cpp:35:
In file included from lib/gui/rs_dialogfactory.h:31:
In file included from lib/gui/rs_dialogfactoryadapter.h:31:
lib/gui/rs_dialogfactoryinterface.h:389:59: warning: 'null' is deprecated: use QString() [-Wdeprecated-declarations]
        virtual void updateMouseWidget(const QString& = QString::null,
                                                                 ^
/usr/local/include/QtCore/qstring.h:912:5: note: 'null' has been explicitly marked deprecated here
    QT_DEPRECATED_X("use QString()")
    ^
/usr/local/include/QtCore/qglobal.h:294:33: note: expanded from macro 'QT_DEPRECATED_X'
#  define QT_DEPRECATED_X(text) Q_DECL_DEPRECATED_X(text)
                                ^
/usr/local/include/QtCore/qcompilerdetection.h:643:55: note: expanded from macro 'Q_DECL_DEPRECATED_X'
#    define Q_DECL_DEPRECATED_X(text) __attribute__ ((__deprecated__(text)))
                                                      ^
In file included from lib/actions/rs_snapper.cpp:35:
In file included from lib/gui/rs_dialogfactory.h:31:
In file included from lib/gui/rs_dialogfactoryadapter.h:31:
lib/gui/rs_dialogfactoryinterface.h:390:38: warning: 'null' is deprecated: use QString() [-Wdeprecated-declarations]
                                                                   const QString& = QString::null)=0;
                                                                                             ^
/usr/local/include/QtCore/qstring.h:912:5: note: 'null' has been explicitly marked deprecated here
    QT_DEPRECATED_X("use QString()")
    ^
/usr/local/include/QtCore/qglobal.h:294:33: note: expanded from macro 'QT_DEPRECATED_X'
#  define QT_DEPRECATED_X(text) Q_DECL_DEPRECATED_X(text)
                                ^
/usr/local/include/QtCore/qcompilerdetection.h:643:55: note: expanded from macro 'Q_DECL_DEPRECATED_X'
#    define Q_DECL_DEPRECATED_X(text) __attribute__ ((__deprecated__(text)))
                                                      ^
In file included from lib/actions/rs_snapper.cpp:35:
In file included from lib/gui/rs_dialogfactory.h:31:
In file included from lib/gui/rs_dialogfactoryadapter.h:32:
In file included from lib/engine/rs_block.h:31:
lib/engine/rs_document.h:65:18: warning: 'isDocument' overrides a member function but is not marked 'override'
      [-Winconsistent-missing-override]
    virtual bool isDocument() const {
                 ^
lib/engine/rs_entity.h:187:18: note: overridden virtual function is here
    virtual bool isDocument() const {
                 ^
In file included from lib/actions/rs_snapper.cpp:35:
In file included from lib/gui/rs_dialogfactory.h:31:
In file included from lib/gui/rs_dialogfactoryadapter.h:32:
In file included from lib/engine/rs_block.h:31:
lib/engine/rs_document.h:73:18: warning: 'removeUndoable' overrides a member function but is not marked 'override'
      [-Winconsistent-missing-override]
    virtual void removeUndoable(RS_Undoable* u) {
                 ^
lib/engine/rs_undo.h:68:18: note: overridden virtual function is here
    virtual void removeUndoable(RS_Undoable* u) = 0;
                 ^
In file included from lib/actions/rs_preview.cpp:32:
lib/engine/rs_settings.h:90:55: warning: 'null' is deprecated: use QString() [-Wdeprecated-declarations]
                        const QString& def = QString::null,
                                                      ^
/usr/local/include/QtCore/qstring.h:912:5: note: 'null' has been explicitly marked deprecated here
    QT_DEPRECATED_X("use QString()")
    ^
/usr/local/include/QtCore/qglobal.h:294:33: note: expanded from macro 'QT_DEPRECATED_X'
#  define QT_DEPRECATED_X(text) Q_DECL_DEPRECATED_X(text)
                                ^
/usr/local/include/QtCore/qcompilerdetection.h:643:55: note: expanded from macro 'Q_DECL_DEPRECATED_X'
#    define Q_DECL_DEPRECATED_X(text) __attribute__ ((__deprecated__(text)))
                                                      ^
In file included from lib/actions/rs_preview.cpp:32:
lib/engine/rs_settings.h:93:55: warning: 'null' is deprecated: use QString() [-Wdeprecated-declarations]
                        const QString& def = QString::null,
                                                      ^
/usr/local/include/QtCore/qstring.h:912:5: note: 'null' has been explicitly marked deprecated here
    QT_DEPRECATED_X("use QString()")
    ^
/usr/local/include/QtCore/qglobal.h:294:33: note: expanded from macro 'QT_DEPRECATED_X'
#  define QT_DEPRECATED_X(text) Q_DECL_DEPRECATED_X(text)
                                ^
/usr/local/include/QtCore/qcompilerdetection.h:643:55: note: expanded from macro 'Q_DECL_DEPRECATED_X'
#    define Q_DECL_DEPRECATED_X(text) __attribute__ ((__deprecated__(text)))
                                                      ^
In file included from lib/actions/rs_actioninterface.cpp:31:
In file included from lib/gui/rs_dialogfactory.h:31:
In file included from lib/gui/rs_dialogfactoryadapter.h:31:
lib/gui/rs_dialogfactoryinterface.h:389:59: warning: 'null' is deprecated: use QString() [-Wdeprecated-declarations]
        virtual void updateMouseWidget(const QString& = QString::null,
                                                                 ^
/usr/local/include/QtCore/qstring.h:912:5: note: 'null' has been explicitly marked deprecated here
    QT_DEPRECATED_X("use QString()")
    ^
/usr/local/include/QtCore/qglobal.h:294:33: note: expanded from macro 'QT_DEPRECATED_X'
#  define QT_DEPRECATED_X(text) Q_DECL_DEPRECATED_X(text)
                                ^
/usr/local/include/QtCore/qcompilerdetection.h:643:55: note: expanded from macro 'Q_DECL_DEPRECATED_X'
#    define Q_DECL_DEPRECATED_X(text) __attribute__ ((__deprecated__(text)))
                                                      ^
In file included from lib/actions/rs_actioninterface.cpp:31:
In file included from lib/gui/rs_dialogfactory.h:31:
In file included from lib/gui/rs_dialogfactoryadapter.h:31:
lib/gui/rs_dialogfactoryinterface.h:390:38: warning: 'null' is deprecated: use QString() [-Wdeprecated-declarations]
                                                                   const QString& = QString::null)=0;
                                                                                             ^
/usr/local/include/QtCore/qstring.h:912:5: note: 'null' has been explicitly marked deprecated here
    QT_DEPRECATED_X("use QString()")
    ^
/usr/local/include/QtCore/qglobal.h:294:33: note: expanded from macro 'QT_DEPRECATED_X'
#  define QT_DEPRECATED_X(text) Q_DECL_DEPRECATED_X(text)
                                ^
/usr/local/include/QtCore/qcompilerdetection.h:643:55: note: expanded from macro 'Q_DECL_DEPRECATED_X'
#    define Q_DECL_DEPRECATED_X(text) __attribute__ ((__deprecated__(text)))
                                                      ^
In file included from lib/actions/rs_actioninterface.cpp:31:
In file included from lib/gui/rs_dialogfactory.h:31:
In file included from lib/gui/rs_dialogfactoryadapter.h:32:
In file included from lib/engine/rs_block.h:31:
lib/engine/rs_document.h:65:18: warning: 'isDocument' overrides a member function but is not marked 'override'
      [-Winconsistent-missing-override]
    virtual bool isDocument() const {
                 ^
lib/engine/rs_entity.h:187:18: note: overridden virtual function is here
    virtual bool isDocument() const {
                 ^
In file included from lib/actions/rs_actioninterface.cpp:31:
In file included from lib/gui/rs_dialogfactory.h:31:
In file included from lib/gui/rs_dialogfactoryadapter.h:32:
In file included from lib/engine/rs_block.h:31:
lib/engine/rs_document.h:73:18: warning: 'removeUndoable' overrides a member function but is not marked 'override'
      [-Winconsistent-missing-override]
    virtual void removeUndoable(RS_Undoable* u) {
                 ^
lib/engine/rs_undo.h:68:18: note: overridden virtual function is here
    virtual void removeUndoable(RS_Undoable* u) = 0;
                 ^
In file included from lib/actions/rs_snapper.cpp:38:
lib/engine/rs_settings.h:90:55: warning: 'null' is deprecated: use QString() [-Wdeprecated-declarations]
                        const QString& def = QString::null,
                                                      ^
/usr/local/include/QtCore/qstring.h:912:5: note: 'null' has been explicitly marked deprecated here
    QT_DEPRECATED_X("use QString()")
    ^
/usr/local/include/QtCore/qglobal.h:294:33: note: expanded from macro 'QT_DEPRECATED_X'
#  define QT_DEPRECATED_X(text) Q_DECL_DEPRECATED_X(text)
                                ^
/usr/local/include/QtCore/qcompilerdetection.h:643:55: note: expanded from macro 'Q_DECL_DEPRECATED_X'
#    define Q_DECL_DEPRECATED_X(text) __attribute__ ((__deprecated__(text)))
                                                      ^
In file included from lib/actions/rs_snapper.cpp:38:
lib/engine/rs_settings.h:93:55: warning: 'null' is deprecated: use QString() [-Wdeprecated-declarations]
                        const QString& def = QString::null,
                                                      ^
/usr/local/include/QtCore/qstring.h:912:5: note: 'null' has been explicitly marked deprecated here
    QT_DEPRECATED_X("use QString()")
    ^
/usr/local/include/QtCore/qglobal.h:294:33: note: expanded from macro 'QT_DEPRECATED_X'
#  define QT_DEPRECATED_X(text) Q_DECL_DEPRECATED_X(text)
                                ^
/usr/local/include/QtCore/qcompilerdetection.h:643:55: note: expanded from macro 'Q_DECL_DEPRECATED_X'
#    define Q_DECL_DEPRECATED_X(text) __attribute__ ((__deprecated__(text)))
                                                      ^
/Library/Developer/CommandLineTools/usr/bin/g++ -c -pipe -g -O2 -std=gnu++11  -arch x86_64 -isysroot /Library/Developer/CommandLineTools/SDKs/MacOSX10.14.sdk -mmacosx-version-min=10.10 -Wall -W -fPIC -DDWGSUPPORT -DQC_APPDIR="LibreCAD" -DLC_VERSION="2.2.0-alpha" -DQT_NO_DEBUG -DQT_SVG_LIB -DQT_PRINTSUPPORT_LIB -DQT_WIDGETS_LIB -DQT_GUI_LIB -DQT_CORE_LIB -I. -I/usr/local/include -I../../libraries/muparser/include -I../../libraries/libdxfrw/src -I../../libraries/jwwlib/src -Icmd -Ilib/actions -Ilib/creation -Ilib/debug -Ilib/engine -Ilib/fileio -Ilib/filters -Ilib/generators -Ilib/gui -Ilib/information -Ilib/math -Ilib/modification -Ilib/printing -Iactions -Imain -Imain/console_dxf2pdf -Itest -Iplugins -Iui -Iui/forms -Iui/generic -I../res -I../../../../anaconda3/include/qt -I../../../../anaconda3/include/qt/QtSvg -I../../../../anaconda3/include/qt/QtPrintSupport -I../../../../anaconda3/include/qt/QtWidgets -I../../../../anaconda3/include/qt/QtGui -I../../../../anaconda3/include/qt/QtCore -I../../generated/librecad/moc -I/Library/Developer/CommandLineTools/SDKs/MacOSX10.14.sdk/System/Library/Frameworks/OpenGL.framework/Headers -I/Library/Developer/CommandLineTools/SDKs/MacOSX10.14.sdk/System/Library/Frameworks/AGL.framework/Headers -I../../generated/librecad/ui -I../../../../anaconda3/mkspecs/macx-g++ -o ../../generated/librecad/obj/rs_creation.o lib/creation/rs_creation.cpp
4 warnings generated.
2 warnings generated.
/Library/Developer/CommandLineTools/usr/bin/g++ -c -pipe -g -O2 -std=gnu++11  -arch x86_64 -isysroot /Library/Developer/CommandLineTools/SDKs/MacOSX10.14.sdk -mmacosx-version-min=10.10 -Wall -W -fPIC -DDWGSUPPORT -DQC_APPDIR="LibreCAD" -DLC_VERSION="2.2.0-alpha" -DQT_NO_DEBUG -DQT_SVG_LIB -DQT_PRINTSUPPORT_LIB -DQT_WIDGETS_LIB -DQT_GUI_LIB -DQT_CORE_LIB -I. -I/usr/local/include -I../../libraries/muparser/include -I../../libraries/libdxfrw/src -I../../libraries/jwwlib/src -Icmd -Ilib/actions -Ilib/creation -Ilib/debug -Ilib/engine -Ilib/fileio -Ilib/filters -Ilib/generators -Ilib/gui -Ilib/information -Ilib/math -Ilib/modification -Ilib/printing -Iactions -Imain -Imain/console_dxf2pdf -Itest -Iplugins -Iui -Iui/forms -Iui/generic -I../res -I../../../../anaconda3/include/qt -I../../../../anaconda3/include/qt/QtSvg -I../../../../anaconda3/include/qt/QtPrintSupport -I../../../../anaconda3/include/qt/QtWidgets -I../../../../anaconda3/include/qt/QtGui -I../../../../anaconda3/include/qt/QtCore -I../../generated/librecad/moc -I/Library/Developer/CommandLineTools/SDKs/MacOSX10.14.sdk/System/Library/Frameworks/OpenGL.framework/Headers -I/Library/Developer/CommandLineTools/SDKs/MacOSX10.14.sdk/System/Library/Frameworks/AGL.framework/Headers -I../../generated/librecad/ui -I../../../../anaconda3/mkspecs/macx-g++ -o ../../generated/librecad/obj/rs_debug.o lib/debug/rs_debug.cpp
/Library/Developer/CommandLineTools/usr/bin/g++ -c -pipe -g -O2 -std=gnu++11  -arch x86_64 -isysroot /Library/Developer/CommandLineTools/SDKs/MacOSX10.14.sdk -mmacosx-version-min=10.10 -Wall -W -fPIC -DDWGSUPPORT -DQC_APPDIR="LibreCAD" -DLC_VERSION="2.2.0-alpha" -DQT_NO_DEBUG -DQT_SVG_LIB -DQT_PRINTSUPPORT_LIB -DQT_WIDGETS_LIB -DQT_GUI_LIB -DQT_CORE_LIB -I. -I/usr/local/include -I../../libraries/muparser/include -I../../libraries/libdxfrw/src -I../../libraries/jwwlib/src -Icmd -Ilib/actions -Ilib/creation -Ilib/debug -Ilib/engine -Ilib/fileio -Ilib/filters -Ilib/generators -Ilib/gui -Ilib/information -Ilib/math -Ilib/modification -Ilib/printing -Iactions -Imain -Imain/console_dxf2pdf -Itest -Iplugins -Iui -Iui/forms -Iui/generic -I../res -I../../../../anaconda3/include/qt -I../../../../anaconda3/include/qt/QtSvg -I../../../../anaconda3/include/qt/QtPrintSupport -I../../../../anaconda3/include/qt/QtWidgets -I../../../../anaconda3/include/qt/QtGui -I../../../../anaconda3/include/qt/QtCore -I../../generated/librecad/moc -I/Library/Developer/CommandLineTools/SDKs/MacOSX10.14.sdk/System/Library/Frameworks/OpenGL.framework/Headers -I/Library/Developer/CommandLineTools/SDKs/MacOSX10.14.sdk/System/Library/Frameworks/AGL.framework/Headers -I../../generated/librecad/ui -I../../../../anaconda3/mkspecs/macx-g++ -o ../../generated/librecad/obj/rs_arc.o lib/engine/rs_arc.cpp
In file included from lib/creation/rs_creation.cpp:28:
In file included from ../../../../anaconda3/include/qt/QtCore/QString:1:
../../../../anaconda3/include/qt/QtCore/qstring.h:862:26: error: no template named 'QConditional' in namespace 'QtPrivate';
      did you mean 'std::conditional'?
        typedef typename QtPrivate::QConditional<isUnsigned, qulonglong, qlonglong>::Type Int64;
                         ^~~~~~~~~~~~~~~~~~~~~~~
                         std::conditional
/Applications/Xcode.app/Contents/Developer/Toolchains/XcodeDefault.xctoolchain/usr/bin/../include/c++/v1/type_traits:429:33: note:
      'std::conditional' declared here
    struct _LIBCPP_TEMPLATE_VIS conditional {typedef _If type;};
                                ^
In file included from lib/creation/rs_creation.cpp:28:
In file included from ../../../../anaconda3/include/qt/QtCore/QString:1:
../../../../anaconda3/include/qt/QtCore/qstring.h:863:26: error: no template named 'QConditional' in namespace 'QtPrivate';
      did you mean 'std::conditional'?
        typedef typename QtPrivate::QConditional<isUnsigned, uint, int>::Type Int32;
                         ^~~~~~~~~~~~~~~~~~~~~~~
                         std::conditional
/Applications/Xcode.app/Contents/Developer/Toolchains/XcodeDefault.xctoolchain/usr/bin/../include/c++/v1/type_traits:429:33: note:
      'std::conditional' declared here
    struct _LIBCPP_TEMPLATE_VIS conditional {typedef _If type;};
                                ^
6 warnings generated.
/Library/Developer/CommandLineTools/usr/bin/g++ -c -pipe -g -O2 -std=gnu++11  -arch x86_64 -isysroot /Library/Developer/CommandLineTools/SDKs/MacOSX10.14.sdk -mmacosx-version-min=10.10 -Wall -W -fPIC -DDWGSUPPORT -DQC_APPDIR="LibreCAD" -DLC_VERSION="2.2.0-alpha" -DQT_NO_DEBUG -DQT_SVG_LIB -DQT_PRINTSUPPORT_LIB -DQT_WIDGETS_LIB -DQT_GUI_LIB -DQT_CORE_LIB -I. -I/usr/local/include -I../../libraries/muparser/include -I../../libraries/libdxfrw/src -I../../libraries/jwwlib/src -Icmd -Ilib/actions -Ilib/creation -Ilib/debug -Ilib/engine -Ilib/fileio -Ilib/filters -Ilib/generators -Ilib/gui -Ilib/information -Ilib/math -Ilib/modification -Ilib/printing -Iactions -Imain -Imain/console_dxf2pdf -Itest -Iplugins -Iui -Iui/forms -Iui/generic -I../res -I../../../../anaconda3/include/qt -I../../../../anaconda3/include/qt/QtSvg -I../../../../anaconda3/include/qt/QtPrintSupport -I../../../../anaconda3/include/qt/QtWidgets -I../../../../anaconda3/include/qt/QtGui -I../../../../anaconda3/include/qt/QtCore -I../../generated/librecad/moc -I/Library/Developer/CommandLineTools/SDKs/MacOSX10.14.sdk/System/Library/Frameworks/OpenGL.framework/Headers -I/Library/Developer/CommandLineTools/SDKs/MacOSX10.14.sdk/System/Library/Frameworks/AGL.framework/Headers -I../../generated/librecad/ui -I../../../../anaconda3/mkspecs/macx-g++ -o ../../generated/librecad/obj/rs_block.o lib/engine/rs_block.cpp
In file included from lib/creation/rs_creation.cpp:29:
In file included from ../../../../anaconda3/include/qt/QtCore/QFileInfo:1:
In file included from ../../../../anaconda3/include/qt/QtCore/qfileinfo.h:43:
In file included from /usr/local/include/QtCore/qfile.h:44:
In file included from /usr/local/include/QtCore/qfiledevice.h:43:
In file included from /usr/local/include/QtCore/qiodevice.h:45:
In file included from /usr/local/include/QtCore/qobject.h:49:
In file included from /usr/local/include/QtCore/qlist.h:47:
/usr/local/include/QtCore/qhashfunctions.h:103:47: error: unknown type name 'QStringView'
Q_CORE_EXPORT Q_DECL_PURE_FUNCTION uint qHash(QStringView key, uint seed = 0) noexcept;
                                              ^
/usr/local/include/QtCore/qhashfunctions.h:106:49: error: unknown type name 'QStringView'
Q_CORE_EXPORT Q_DECL_PURE_FUNCTION uint qt_hash(QStringView key, uint chained = 0) noexcept;
                                                ^
/usr/local/include/QtCore/qhashfunctions.h:206:47: error: no member named 'QStringView' in the global namespace
QT_SPECIALIZE_STD_HASH_TO_CALL_QHASH_BY_VALUE(QStringView)
~~~~~~~~~~~~~~~~~~~~~~~~~~~~~~~~~~~~~~~~~~~~~~^~~~~~~~~~~~
/usr/local/include/QtCore/qhashfunctions.h:202:42: note: expanded from macro 'QT_SPECIALIZE_STD_HASH_TO_CALL_QHASH_BY_VALUE'
    QT_SPECIALIZE_STD_HASH_TO_CALL_QHASH(Class, argument_type)
    ~~~~~~~~~~~~~~~~~~~~~~~~~~~~~~~~~~~~~^~~~~~~~~~~~~~~~~~~~~
/usr/local/include/QtCore/qhashfunctions.h:180:43: note: expanded from macro 'QT_SPECIALIZE_STD_HASH_TO_CALL_QHASH'
        struct hash< QT_PREPEND_NAMESPACE(Class) > {                \
                     ~~~~~~~~~~~~~~~~~~~~~^~~~~~
/usr/local/include/QtCore/qglobal.h:146:39: note: expanded from macro 'QT_PREPEND_NAMESPACE'
# define QT_PREPEND_NAMESPACE(name) ::name
                                    ~~^
In file included from lib/creation/rs_creation.cpp:29:
In file included from ../../../../anaconda3/include/qt/QtCore/QFileInfo:1:
In file included from ../../../../anaconda3/include/qt/QtCore/qfileinfo.h:43:
In file included from /usr/local/include/QtCore/qfile.h:44:
In file included from /usr/local/include/QtCore/qfiledevice.h:43:
In file included from /usr/local/include/QtCore/qiodevice.h:45:
In file included from /usr/local/include/QtCore/qobject.h:49:
In file included from /usr/local/include/QtCore/qlist.h:48:
/usr/local/include/QtCore/qvector.h:1134:15: error: use of undeclared identifier 'QStringView'
QVector<uint> QStringView::toUcs4() const { return QtPrivate::convertToUcs4(*this); }
              ^
/usr/local/include/QtCore/qvector.h:1136:30: error: out-of-line definition of 'splitRef' does not match any declaration in
      'QString'
QVector<QStringRef> QString::splitRef(const QString &sep, Qt::SplitBehavior behavior, Qt::CaseSensitivity cs) const
                             ^~~~~~~~
/usr/local/include/QtCore/qvector.h:1137:24: error: use of undeclared identifier '_sb'
{ return splitRef(sep, _sb(behavior), cs); }
                       ^
/usr/local/include/QtCore/qvector.h:1138:30: error: out-of-line definition of 'splitRef' does not match any declaration in
      'QString'
QVector<QStringRef> QString::splitRef(QChar sep, Qt::SplitBehavior behavior, Qt::CaseSensitivity cs) const
                             ^~~~~~~~
/usr/local/include/QtCore/qvector.h:1139:24: error: use of undeclared identifier '_sb'
{ return splitRef(sep, _sb(behavior), cs); }
                       ^
/usr/local/include/QtCore/qvector.h:1141:30: error: out-of-line definition of 'splitRef' does not match any declaration in
      'QString'
QVector<QStringRef> QString::splitRef(const QRegExp &sep, Qt::SplitBehavior behavior) const
                             ^~~~~~~~
/usr/local/include/QtCore/qvector.h:1142:24: error: use of undeclared identifier '_sb'
{ return splitRef(sep, _sb(behavior)); }
                       ^
/usr/local/include/QtCore/qvector.h:1145:30: error: out-of-line definition of 'splitRef' does not match any declaration in
      'QString'
QVector<QStringRef> QString::splitRef(const QRegularExpression &sep, Qt::SplitBehavior behavior) const
                             ^~~~~~~~
/usr/local/include/QtCore/qvector.h:1146:24: error: use of undeclared identifier '_sb'
{ return splitRef(sep, _sb(behavior)); }
                       ^
/usr/local/include/QtCore/qvector.h:1148:33: error: out-of-line definition of 'split' does not match any declaration in
      'QStringRef'
QVector<QStringRef> QStringRef::split(const QString &sep, Qt::SplitBehavior behavior, Qt::CaseSensitivity cs) const
                                ^~~~~
/usr/local/include/QtCore/qvector.h:1149:30: error: no member named '_sb' in 'QString'
{ return split(sep, QString::_sb(behavior), cs); }
                    ~~~~~~~~~^
/usr/local/include/QtCore/qvector.h:1150:33: error: out-of-line definition of 'split' does not match any declaration in
      'QStringRef'
QVector<QStringRef> QStringRef::split(QChar sep, Qt::SplitBehavior behavior, Qt::CaseSensitivity cs) const
                                ^~~~~
/usr/local/include/QtCore/qvector.h:1151:30: error: no member named '_sb' in 'QString'
{ return split(sep, QString::_sb(behavior), cs); }
                    ~~~~~~~~~^
In file included from lib/creation/rs_creation.cpp:29:
In file included from ../../../../anaconda3/include/qt/QtCore/QFileInfo:1:
In file included from ../../../../anaconda3/include/qt/QtCore/qfileinfo.h:43:
In file included from /usr/local/include/QtCore/qfile.h:44:
In file included from /usr/local/include/QtCore/qfiledevice.h:43:
In file included from /usr/local/include/QtCore/qiodevice.h:45:
In file included from /usr/local/include/QtCore/qobject.h:49:
In file included from /usr/local/include/QtCore/qlist.h:1179:
In file included from /usr/local/include/QtCore/qstringlist.h:50:
In file included from /usr/local/include/QtCore/qstringmatcher.h:45:
In file included from /usr/local/include/QtCore/qstringview.h:49:
/usr/local/include/QtCore/qstringliteral.h:64:9: warning: 'QT_UNICODE_LITERAL' macro redefined [-Wmacro-redefined]
#define QT_UNICODE_LITERAL(str) u"" str
        ^
../../../../anaconda3/include/qt/QtCore/qstring.h:173:9: note: previous definition is here
#define QT_UNICODE_LITERAL(str) QT_UNICODE_LITERAL_II(str)
        ^
In file included from lib/creation/rs_creation.cpp:29:
In file included from ../../../../anaconda3/include/qt/QtCore/QFileInfo:1:
In file included from ../../../../anaconda3/include/qt/QtCore/qfileinfo.h:43:
In file included from /usr/local/include/QtCore/qfile.h:44:
In file included from /usr/local/include/QtCore/qfiledevice.h:43:
In file included from /usr/local/include/QtCore/qiodevice.h:45:
In file included from /usr/local/include/QtCore/qobject.h:49:
In file included from /usr/local/include/QtCore/qlist.h:1179:
In file included from /usr/local/include/QtCore/qstringlist.h:50:
In file included from /usr/local/include/QtCore/qstringmatcher.h:45:
In file included from /usr/local/include/QtCore/qstringview.h:49:
/usr/local/include/QtCore/qstringliteral.h:65:9: warning: 'QStringLiteral' macro redefined [-Wmacro-redefined]
#define QStringLiteral(str) \
        ^
../../../../anaconda3/include/qt/QtCore/qstring.h:174:9: note: previous definition is here
#define QStringLiteral(str) \
        ^
In file included from lib/creation/rs_creation.cpp:29:
In file included from ../../../../anaconda3/include/qt/QtCore/QFileInfo:1:
In file included from ../../../../anaconda3/include/qt/QtCore/qfileinfo.h:43:
In file included from /usr/local/include/QtCore/qfile.h:44:
In file included from /usr/local/include/QtCore/qfiledevice.h:43:
In file included from /usr/local/include/QtCore/qiodevice.h:45:
In file included from /usr/local/include/QtCore/qobject.h:49:
In file included from /usr/local/include/QtCore/qlist.h:1179:
In file included from /usr/local/include/QtCore/qstringlist.h:50:
In file included from /usr/local/include/QtCore/qstringmatcher.h:45:
In file included from /usr/local/include/QtCore/qstringview.h:49:
/usr/local/include/QtCore/qstringliteral.h:90:8: error: redefinition of 'QStaticStringData'
struct QStaticStringData
       ^
../../../../anaconda3/include/qt/QtCore/qstring.h:195:8: note: previous definition is here
struct QStaticStringData
       ^
fatal error: too many errors emitted, stopping now [-ferror-limit=]
In file included from lib/debug/rs_debug.cpp:33:
In file included from ../../../../anaconda3/include/qt/QtCore/QString:1:
../../../../anaconda3/include/qt/QtCore/qstring.h:862:26: error: no template named 'QConditional' in namespace 'QtPrivate';
      did you mean 'std::conditional'?
        typedef typename QtPrivate::QConditional<isUnsigned, qulonglong, qlonglong>::Type Int64;
                         ^~~~~~~~~~~~~~~~~~~~~~~
                         std::conditional
/Applications/Xcode.app/Contents/Developer/Toolchains/XcodeDefault.xctoolchain/usr/bin/../include/c++/v1/type_traits:429:33: note:
      'std::conditional' declared here
    struct _LIBCPP_TEMPLATE_VIS conditional {typedef _If type;};
                                ^
In file included from lib/debug/rs_debug.cpp:33:
In file included from ../../../../anaconda3/include/qt/QtCore/QString:1:
../../../../anaconda3/include/qt/QtCore/qstring.h:863:26: error: no template named 'QConditional' in namespace 'QtPrivate';
      did you mean 'std::conditional'?
        typedef typename QtPrivate::QConditional<isUnsigned, uint, int>::Type Int32;
                         ^~~~~~~~~~~~~~~~~~~~~~~
                         std::conditional
/Applications/Xcode.app/Contents/Developer/Toolchains/XcodeDefault.xctoolchain/usr/bin/../include/c++/v1/type_traits:429:33: note:
      'std::conditional' declared here
    struct _LIBCPP_TEMPLATE_VIS conditional {typedef _If type;};
                                ^
In file included from lib/debug/rs_debug.cpp:35:
In file included from ../../../../anaconda3/include/qt/QtCore/QDateTime:1:
In file included from ../../../../anaconda3/include/qt/QtCore/qdatetime.h:46:
In file included from /usr/local/include/QtCore/qshareddata.h:46:
In file included from /usr/local/include/QtCore/qhash.h:46:
In file included from /usr/local/include/QtCore/qlist.h:47:
/usr/local/include/QtCore/qhashfunctions.h:103:47: error: unknown type name 'QStringView'
Q_CORE_EXPORT Q_DECL_PURE_FUNCTION uint qHash(QStringView key, uint seed = 0) noexcept;
                                              ^
/usr/local/include/QtCore/qhashfunctions.h:106:49: error: unknown type name 'QStringView'
Q_CORE_EXPORT Q_DECL_PURE_FUNCTION uint qt_hash(QStringView key, uint chained = 0) noexcept;
                                                ^
/usr/local/include/QtCore/qhashfunctions.h:206:47: error: no member named 'QStringView' in the global namespace
QT_SPECIALIZE_STD_HASH_TO_CALL_QHASH_BY_VALUE(QStringView)
~~~~~~~~~~~~~~~~~~~~~~~~~~~~~~~~~~~~~~~~~~~~~~^~~~~~~~~~~~
/usr/local/include/QtCore/qhashfunctions.h:202:42: note: expanded from macro 'QT_SPECIALIZE_STD_HASH_TO_CALL_QHASH_BY_VALUE'
    QT_SPECIALIZE_STD_HASH_TO_CALL_QHASH(Class, argument_type)
    ~~~~~~~~~~~~~~~~~~~~~~~~~~~~~~~~~~~~~^~~~~~~~~~~~~~~~~~~~~
/usr/local/include/QtCore/qhashfunctions.h:180:43: note: expanded from macro 'QT_SPECIALIZE_STD_HASH_TO_CALL_QHASH'
        struct hash< QT_PREPEND_NAMESPACE(Class) > {                \
                     ~~~~~~~~~~~~~~~~~~~~~^~~~~~
/usr/local/include/QtCore/qglobal.h:146:39: note: expanded from macro 'QT_PREPEND_NAMESPACE'
# define QT_PREPEND_NAMESPACE(name) ::name
                                    ~~^
In file included from lib/debug/rs_debug.cpp:35:
In file included from ../../../../anaconda3/include/qt/QtCore/QDateTime:1:
In file included from ../../../../anaconda3/include/qt/QtCore/qdatetime.h:46:
In file included from /usr/local/include/QtCore/qshareddata.h:46:
In file included from /usr/local/include/QtCore/qhash.h:46:
In file included from /usr/local/include/QtCore/qlist.h:48:
/usr/local/include/QtCore/qvector.h:1134:15: error: use of undeclared identifier 'QStringView'
QVector<uint> QStringView::toUcs4() const { return QtPrivate::convertToUcs4(*this); }
              ^
/usr/local/include/QtCore/qvector.h:1136:30: error: out-of-line definition of 'splitRef' does not match any declaration in
      'QString'
QVector<QStringRef> QString::splitRef(const QString &sep, Qt::SplitBehavior behavior, Qt::CaseSensitivity cs) const
                             ^~~~~~~~
/usr/local/include/QtCore/qvector.h:1137:24: error: use of undeclared identifier '_sb'
{ return splitRef(sep, _sb(behavior), cs); }
                       ^
/usr/local/include/QtCore/qvector.h:1138:30: error: out-of-line definition of 'splitRef' does not match any declaration in
      'QString'
QVector<QStringRef> QString::splitRef(QChar sep, Qt::SplitBehavior behavior, Qt::CaseSensitivity cs) const
                             ^~~~~~~~
/usr/local/include/QtCore/qvector.h:1139:24: error: use of undeclared identifier '_sb'
{ return splitRef(sep, _sb(behavior), cs); }
                       ^
/usr/local/include/QtCore/qvector.h:1141:30: error: out-of-line definition of 'splitRef' does not match any declaration in
      'QString'
QVector<QStringRef> QString::splitRef(const QRegExp &sep, Qt::SplitBehavior behavior) const
                             ^~~~~~~~
/usr/local/include/QtCore/qvector.h:1142:24: error: use of undeclared identifier '_sb'
{ return splitRef(sep, _sb(behavior)); }
                       ^
/usr/local/include/QtCore/qvector.h:1145:30: error: out-of-line definition of 'splitRef' does not match any declaration in
      'QString'
QVector<QStringRef> QString::splitRef(const QRegularExpression &sep, Qt::SplitBehavior behavior) const
                             ^~~~~~~~
/usr/local/include/QtCore/qvector.h:1146:24: error: use of undeclared identifier '_sb'
{ return splitRef(sep, _sb(behavior)); }
                       ^
/usr/local/include/QtCore/qvector.h:1148:33: error: out-of-line definition of 'split' does not match any declaration in
      'QStringRef'
QVector<QStringRef> QStringRef::split(const QString &sep, Qt::SplitBehavior behavior, Qt::CaseSensitivity cs) const
                                ^~~~~
/usr/local/include/QtCore/qvector.h:1149:30: error: no member named '_sb' in 'QString'
{ return split(sep, QString::_sb(behavior), cs); }
                    ~~~~~~~~~^
/usr/local/include/QtCore/qvector.h:1150:33: error: out-of-line definition of 'split' does not match any declaration in
      'QStringRef'
QVector<QStringRef> QStringRef::split(QChar sep, Qt::SplitBehavior behavior, Qt::CaseSensitivity cs) const
                                ^~~~~
/usr/local/include/QtCore/qvector.h:1151:30: error: no member named '_sb' in 'QString'
{ return split(sep, QString::_sb(behavior), cs); }
                    ~~~~~~~~~^
In file included from lib/debug/rs_debug.cpp:35:
In file included from ../../../../anaconda3/include/qt/QtCore/QDateTime:1:
In file included from ../../../../anaconda3/include/qt/QtCore/qdatetime.h:46:
In file included from /usr/local/include/QtCore/qshareddata.h:46:
In file included from /usr/local/include/QtCore/qhash.h:46:
In file included from /usr/local/include/QtCore/qlist.h:1179:
In file included from /usr/local/include/QtCore/qstringlist.h:50:
In file included from /usr/local/include/QtCore/qstringmatcher.h:45:
In file included from /usr/local/include/QtCore/qstringview.h:49:
/usr/local/include/QtCore/qstringliteral.h:64:9: warning: 'QT_UNICODE_LITERAL' macro redefined [-Wmacro-redefined]
#define QT_UNICODE_LITERAL(str) u"" str
        ^
../../../../anaconda3/include/qt/QtCore/qstring.h:173:9: note: previous definition is here
#define QT_UNICODE_LITERAL(str) QT_UNICODE_LITERAL_II(str)
        ^
In file included from lib/debug/rs_debug.cpp:35:
In file included from ../../../../anaconda3/include/qt/QtCore/QDateTime:1:
In file included from ../../../../anaconda3/include/qt/QtCore/qdatetime.h:46:
In file included from /usr/local/include/QtCore/qshareddata.h:46:
In file included from /usr/local/include/QtCore/qhash.h:46:
In file included from /usr/local/include/QtCore/qlist.h:1179:
In file included from /usr/local/include/QtCore/qstringlist.h:50:
In file included from /usr/local/include/QtCore/qstringmatcher.h:45:
In file included from /usr/local/include/QtCore/qstringview.h:49:
/usr/local/include/QtCore/qstringliteral.h:65:9: warning: 'QStringLiteral' macro redefined [-Wmacro-redefined]
#define QStringLiteral(str) \
        ^
../../../../anaconda3/include/qt/QtCore/qstring.h:174:9: note: previous definition is here
#define QStringLiteral(str) \
        ^
In file included from lib/debug/rs_debug.cpp:35:
In file included from ../../../../anaconda3/include/qt/QtCore/QDateTime:1:
In file included from ../../../../anaconda3/include/qt/QtCore/qdatetime.h:46:
In file included from /usr/local/include/QtCore/qshareddata.h:46:
In file included from /usr/local/include/QtCore/qhash.h:46:
In file included from /usr/local/include/QtCore/qlist.h:1179:
In file included from /usr/local/include/QtCore/qstringlist.h:50:
In file included from /usr/local/include/QtCore/qstringmatcher.h:45:
In file included from /usr/local/include/QtCore/qstringview.h:49:
/usr/local/include/QtCore/qstringliteral.h:90:8: error: redefinition of 'QStaticStringData'
struct QStaticStringData
       ^
../../../../anaconda3/include/qt/QtCore/qstring.h:195:8: note: previous definition is here
struct QStaticStringData
       ^
fatal error: too many errors emitted, stopping now [-ferror-limit=]
2 warnings and 20 errors generated.
make[2]: *** [../../generated/librecad/obj/rs_creation.o] Error 1
make[2]: *** Waiting for unfinished jobs....
2 warnings and 20 errors generated.
make[2]: *** [../../generated/librecad/obj/rs_debug.o] Error 1
In file included from lib/engine/rs_arc.cpp:31:
lib/engine/rs_constructionline.h:70:21: warning: 'clone' overrides a member function but is not marked 'override'
      [-Winconsistent-missing-override]
        virtual RS_Entity* clone() const;
                           ^
lib/engine/rs_entity.h:69:21: note: overridden virtual function is here
        virtual RS_Entity* clone() const = 0;
                           ^
In file included from lib/engine/rs_arc.cpp:31:
lib/engine/rs_constructionline.h:75:29: warning: 'rtti' overrides a member function but is not marked 'override'
      [-Winconsistent-missing-override]
    virtual RS2::EntityType rtti() const {
                            ^
lib/engine/rs_entity.h:82:26: note: overridden virtual function is here
        virtual RS2::EntityType rtti() const{
                                ^
In file included from lib/engine/rs_arc.cpp:31:
lib/engine/rs_constructionline.h:103:26: warning: 'getQuadratic' overrides a member function but is not marked 'override'
      [-Winconsistent-missing-override]
    virtual LC_Quadratic getQuadratic() const;
                         ^
lib/engine/rs_entity.h:535:26: note: overridden virtual function is here
    virtual LC_Quadratic getQuadratic() const;
                         ^
In file included from lib/engine/rs_arc.cpp:31:
lib/engine/rs_constructionline.h:104:23: warning: 'getMiddlePoint' overrides a member function but is not marked 'override'
      [-Winconsistent-missing-override]
    virtual RS_Vector getMiddlePoint(void) const;
                      ^
lib/engine/rs_entity.h:336:23: note: overridden virtual function is here
    virtual RS_Vector getMiddlePoint(void)const{
                      ^
In file included from lib/engine/rs_arc.cpp:31:
lib/engine/rs_constructionline.h:105:23: warning: 'getNearestEndpoint' overrides a member function but is not marked
      'override' [-Winconsistent-missing-override]
    virtual RS_Vector getNearestEndpoint(const RS_Vector& coord,
                      ^
lib/engine/rs_entity.h:291:23: note: overridden virtual function is here
    virtual RS_Vector getNearestEndpoint(const RS_Vector& coord,
                      ^
In file included from lib/engine/rs_arc.cpp:31:
lib/engine/rs_constructionline.h:107:23: warning: 'getNearestPointOnEntity' overrides a member function but is not marked
      'override' [-Winconsistent-missing-override]
    virtual RS_Vector getNearestPointOnEntity(const RS_Vector& coord,
                      ^
lib/engine/rs_entity.h:305:23: note: overridden virtual function is here
    virtual RS_Vector getNearestPointOnEntity(const RS_Vector& /*coord*/,
                      ^
In file included from lib/engine/rs_arc.cpp:31:
lib/engine/rs_constructionline.h:109:23: warning: 'getNearestCenter' overrides a member function but is not marked 'override'
      [-Winconsistent-missing-override]
    virtual RS_Vector getNearestCenter(const RS_Vector& coord,
                      ^
lib/engine/rs_atomicentity.h:105:14: note: overridden virtual function is here
   RS_Vector getNearestCenter(const RS_Vector& /*coord*/,
             ^
In file included from lib/engine/rs_arc.cpp:31:
lib/engine/rs_constructionline.h:111:23: warning: 'getNearestMiddle' overrides a member function but is not marked 'override'
      [-Winconsistent-missing-override]
    virtual RS_Vector getNearestMiddle(const RS_Vector& coord,
                      ^
lib/engine/rs_entity.h:339:23: note: overridden virtual function is here
    virtual RS_Vector getNearestMiddle(const RS_Vector& coord,
                      ^
In file included from lib/engine/rs_arc.cpp:31:
lib/engine/rs_constructionline.h:114:23: warning: 'getNearestDist' overrides a member function but is not marked 'override'
      [-Winconsistent-missing-override]
    virtual RS_Vector getNearestDist(double distance,
                      ^
lib/engine/rs_entity.h:357:23: note: overridden virtual function is here
    virtual RS_Vector getNearestDist(double distance,
                      ^
In file included from lib/engine/rs_arc.cpp:31:
lib/engine/rs_constructionline.h:117:20: warning: 'getDistanceToPoint' overrides a member function but is not marked
      'override' [-Winconsistent-missing-override]
    virtual double getDistanceToPoint(const RS_Vector& coord,
                   ^
lib/engine/rs_entity.h:422:20: note: overridden virtual function is here
    virtual double getDistanceToPoint(const RS_Vector& coord,
                   ^
In file included from lib/engine/rs_arc.cpp:31:
lib/engine/rs_constructionline.h:122:18: warning: 'move' overrides a member function but is not marked 'override'
      [-Winconsistent-missing-override]
    virtual void move(const RS_Vector& offset);
                 ^
lib/engine/rs_entity.h:450:18: note: overridden virtual function is here
    virtual void move(const RS_Vector& offset) = 0;
                 ^
In file included from lib/engine/rs_arc.cpp:31:
lib/engine/rs_constructionline.h:123:18: warning: 'rotate' overrides a member function but is not marked 'override'
      [-Winconsistent-missing-override]
    virtual void rotate(const RS_Vector& center, const double& angle);
                 ^
lib/engine/rs_entity.h:456:18: note: overridden virtual function is here
    virtual void rotate(const RS_Vector& center, const double& angle) = 0;
                 ^
In file included from lib/engine/rs_arc.cpp:31:
lib/engine/rs_constructionline.h:124:18: warning: 'rotate' overrides a member function but is not marked 'override'
      [-Winconsistent-missing-override]
    virtual void rotate(const RS_Vector& center, const RS_Vector& angleVector);
                 ^
lib/engine/rs_entity.h:457:18: note: overridden virtual function is here
    virtual void rotate(const RS_Vector& center, const RS_Vector& angleVector) = 0;
                 ^
In file included from lib/engine/rs_arc.cpp:31:
lib/engine/rs_constructionline.h:125:18: warning: 'scale' overrides a member function but is not marked 'override'
      [-Winconsistent-missing-override]
    virtual void scale(const RS_Vector& center, const RS_Vector& factor);
                 ^
lib/engine/rs_entity.h:462:18: note: overridden virtual function is here
    virtual void scale(const RS_Vector& center, const RS_Vector& factor) = 0;
                 ^
In file included from lib/engine/rs_arc.cpp:31:
lib/engine/rs_constructionline.h:126:18: warning: 'mirror' overrides a member function but is not marked 'override'
      [-Winconsistent-missing-override]
    virtual void mirror(const RS_Vector& axisPoint1, const RS_Vector& axisPoint2);
                 ^
lib/engine/rs_entity.h:477:18: note: overridden virtual function is here
    virtual void mirror(const RS_Vector& axisPoint1, const RS_Vector& axisPoint2) = 0;
                 ^
In file included from lib/engine/rs_arc.cpp:31:
lib/engine/rs_constructionline.h:128:18: warning: 'draw' overrides a member function but is not marked 'override'
      [-Winconsistent-missing-override]
    virtual void draw(RS_Painter* /*painter*/, RS_GraphicView* /*view*/,
                 ^
lib/engine/rs_entity.h:507:18: note: overridden virtual function is here
    virtual void draw(RS_Painter* painter, RS_GraphicView* view,
                 ^
In file included from lib/engine/rs_arc.cpp:31:
lib/engine/rs_constructionline.h:134:18: warning: 'calculateBorders' overrides a member function but is not marked 'override'
      [-Winconsistent-missing-override]
    virtual void calculateBorders();
                 ^
lib/engine/rs_entity.h:520:18: note: overridden virtual function is here
    virtual void calculateBorders() = 0;
                 ^
In file included from lib/engine/rs_block.cpp:28:
In file included from lib/engine/rs_block.h:31:
lib/engine/rs_document.h:65:18: warning: 'isDocument' overrides a member function but is not marked 'override'
      [-Winconsistent-missing-override]
    virtual bool isDocument() const {
                 ^
lib/engine/rs_entity.h:187:18: note: overridden virtual function is here
    virtual bool isDocument() const {
                 ^
In file included from lib/engine/rs_block.cpp:28:
In file included from lib/engine/rs_block.h:31:
lib/engine/rs_document.h:73:18: warning: 'removeUndoable' overrides a member function but is not marked 'override'
      [-Winconsistent-missing-override]
    virtual void removeUndoable(RS_Undoable* u) {
                 ^
lib/engine/rs_undo.h:68:18: note: overridden virtual function is here
    virtual void removeUndoable(RS_Undoable* u) = 0;
                 ^
2 warnings generated.
17 warnings generated.
make[1]: *** [sub-src-make_first] Error 2
make: *** [sub-librecad-make_first-ordered] Error 2
Reply | Threaded
Open this post in threaded view
|

Re: build from source in osx error

LordOfBikes
Administrator
This looks like an issue with Qt.
What is the output of:
qmake --version
Have you multiple Qt versions installed?